{"text_format":"1","workbook":"xlsx","n_sheets":5,"sheets":["CS_Upload","Import","Form_32","CS_Data","Form 32 Instructions"],"not_rendered":{"charts":0,"images":0,"macros":1,"external_links":1,"defined_names":7,"comments":0,"pivot_tables":0},"unopened":[],"bounds":{"document_bytes":16777216,"sheet_cells":100000,"rows_first":2000,"rows_last":500,"rows_between":2000,"halvings":0,"cell_chars":16384,"cell_head_chars":4096},"cells_cut":0,"cells_raw":0,"read":"whole","date_system":"1900"}

{"sheet":"CS_Upload","index":0,"n_rows":1,"n_cols":9,"rows_kept":1,"cut":false,"hidden":false,"merged":[]}
["Sponsored Program ","Fund","Cost Center/Fund Center","Order ","WBS Element ","Sponsored Class","Amount ","Fiscal Year","DK"]

{"sheet":"Import","index":1,"n_rows":0,"n_cols":0,"rows_kept":0,"cut":false,"hidden":true,"merged":[]}

{"sheet":"Form_32","index":2,"n_rows":45,"n_cols":31,"rows_kept":45,"cut":false,"hidden":false,"merged":[[1,1,1,18],[2,17,2,18],[22,9,22,10],[22,13,22,14],[22,15,22,16],[23,15,23,16],[34,15,34,16],[35,15,35,16],[37,13,37,14],[37,11,37,12],[37,15,37,16],[23,13,23,14],[23,9,23,10],[24,15,24,16],[24,9,24,10],[25,9,25,10],[26,9,26,10],[15,2,15,3],[15,4,15,6],[29,13,29,14],[36,15,36,16],[24,13,24,14],[25,13,25,14],[27,15,27,16],[43,15,43,16],[34,13,34,14],[35,13,35,14],[36,13,36,14],[38,13,38,14],[42,13,42,14],[41,11,41,12],[41,13,41,14],[30,9,30,10],[31,9,31,10],[30,11,30,12],[42,15,42,16],[39,15,39,16],[38,15,38,16],[41,15,41,16],[40,15,40,16],[39,13,39,14],[40,13,40,14],[32,13,32,14],[33,13,33,14],[43,13,43,14],[43,11,43,12],[43,7,43,8],[28,7,28,8],[43,9,43,10],[39,7,39,8],[31,7,31,8],[32,7,32,8],[42,11,42,12],[31,11,31,12],[36,11,36,12],[38,11,38,12],[39,11,39,12],[37,7,37,8],[37,9,37,10],[25,15,25,16],[26,15,26,16],[30,15,30,16],[31,15,31,16],[32,15,32,16],[33,15,33,16],[29,15,29,16],[28,15,28,16],[28,13,28,14],[26,13,26,14],[27,13,27,14],[30,13,30,14],[31,13,31,14],[2,1,2,4],[19,9,19,10],[19,7,19,8],[39,3,39,4],[39,5,39,6],[23,3,23,4],[28,3,28,4],[28,5,28,6],[25,3,25,4],[24,3,24,4],[30,3,30,4],[24,5,24,6],[25,5,25,6],[26,5,26,6],[30,5,30,6],[31,5,31,6],[32,5,32,6],[29,5,29,6],[2,9,2,12],[34,9,34,10],[26,3,26,4],[33,5,33,6],[24,7,24,8],[25,7,25,8],[43,5,43,6],[40,5,40,6],[42,5,42,6],[41,3,41,4],[34,7,34,8],[35,7,35,8],[36,7,36,8],[38,7,38,8],[41,9,41,10],[43,3,43,4],[42,3,42,4],[40,3,40,4],[41,5,41,6],[42,7,42,8],[42,9,42,10],[40,7,40,8],[41,7,41,8],[26,7,26,8],[35,11,35,12],[30,7,30,8],[23,11,23,12],[40,11,40,12],[28,11,28,12],[28,9,28,10],[39,9,39,10],[29,9,29,10],[35,9,35,10],[36,9,36,10],[38,9,38,10],[27,9,27,10],[27,11,27,12],[24,11,24,12],[25,11,25,12],[26,11,26,12],[29,11,29,12],[32,9,32,10],[33,9,33,10],[32,11,32,12],[33,11,33,12],[34,11,34,12],[40,9,40,10],[29,3,29,4],[21,3,21,4],[21,7,21,8],[35,5,35,6],[36,5,36,6],[38,5,38,6],[29,7,29,8],[37,3,37,4],[37,5,37,6],[22,7,22,8],[23,7,23,8],[23,5,23,6],[34,5,34,6],[27,3,27,4],[27,5,27,6],[38,3,38,4],[36,3,36,4],[31,3,31,4],[32,3,32,4],[35,3,35,4],[33,3,33,4],[34,3,34,4],[33,7,33,8],[27,7,27,8],[19,3,19,4],[19,5,19,6],[22,5,22,6],[19,15,19,16],[6,1,6,4],[5,1,5,4],[4,1,4,4],[22,3,22,4],[20,0,20,1],[21,5,21,6],[19,13,19,14],[21,11,21,12],[4,9,4,12],[5,9,5,12],[7,9,7,12],[21,9,21,10],[22,11,22,12],[19,11,19,12],[15,7,15,8],[15,9,15,12],[14,2,14,3],[17,3,17,4],[17,5,17,6],[17,7,17,8],[3,1,3,4],[11,1,11,3],[3,13,3,18],[4,13,15,18],[10,7,10,10],[11,7,11,10],[14,9,14,12],[14,7,14,8],[12,1,12,3],[3,9,3,12],[6,9,6,12],[8,9,8,12],[14,4,14,6],[13,1,13,3],[12,7,12,10],[9,9,9,12],[17,9,17,10],[17,11,17,12],[17,13,17,14],[17,15,17,16],[18,3,18,4],[18,5,18,6],[18,7,18,8],[18,9,18,10],[18,11,18,12],[18,13,18,14],[18,15,18,16]]}
[]
[null,"COST SHARE COMMITMENT FORM",null,null,null,null,null,null,null,null,null,null,null,null,null,null,null,null,null,null,null,null,null,null,null,null,"Dollar Commitment",null,null,"Committed - Sponsor Required in RFP","Original "]
["Cost Share Method",null,null,null,null,null,"Cost Share Type",null,null,"Committed - Sponsor Required in RFP",null,null,null,"Form Date:",null,null,"Form Type:",null,null,null,null,null,null,null,null,null,"Memo Match",null,null,"Committed - In Excess of Sponsor Required in RFP","Revised"]
["Dept Name (Source)",null,null,null,null,"                           ","Agency / Sponsor",null,null,null,null,null,null,"Notes (include Memo Match info here or attach info):"]
["PI",null,null,null,null,null,"Proposal Development #",null,null,null,null,null,null,null,null,null,null,null,null,null,null,null,null,null,null,null,"Percent of Effort",null,null,"Committed - Not Required by Sponsor"]
["Project Period",null,null,null,null,null,"Approved By (Signature)",null,null,null,null,null,null,null,null,null,null,null,null,null,null,null,null,null,null,null,"Percent of Sponsor Award",null,null,"No Cost Share"]
["Title",null,null,null,null,null,"Approved By (Typed/Printed)",null,null,null,null,null,null,null,null,null,null,null,null,null,null,null,null,null,null,null,null,null,null,"Salary Cap"]
[]
["Yr 1 Proj Period",null,null,null,null,null,"SPS Memo Match Approval "]
[null,"Start","End"]
["For Department Use (This information is for account setup only, not source) ",null,null,null,null,null,"Fund:"]
["Responsible Cost Center:",null,null,null,null,null,"Co-PI Name:"]
["WBSE Description:",null,null,null,null,null,"Person ID #:"]
[]
["For Post Award Use ",null,"Grant number",null,null,null,null,"Grant Sponsored Program"]
[null,null,"Source Account",null,null,null,null,"Sponsored Program Fund"]
["*This form will be used for the Cost Share Budget Upload Template"]
[null,null,"Distribution Key","JUL",null,"JUL",null,"JUL",null,"JUL",null,"JUL",null,"JUL",null,"JUL"]
[null,null,"Fiscal Year",{"$f":"IFERROR(IF(MONTH(D21) >= 7, YEAR(D21) + 1, YEAR(D21)),\"\")","v":""},null,{"$f":"IFERROR(IF(MONTH(F21) >= 7, YEAR(F21) + 1, YEAR(F21)),\"\")","v":""},null,{"$f":"IFERROR(IF(MONTH(H21) >= 7, YEAR(H21) + 1, YEAR(H21)),\"\")","v":""},null,{"$f":"IFERROR(IF(MONTH(J21) >= 7, YEAR(J21) + 1, YEAR(J21)),\"\")","v":""},null,{"$f":"IFERROR(IF(MONTH(L21) >= 7, YEAR(L21) + 1, YEAR(L21)),\"\")","v":""},null,{"$f":"IFERROR(IF(MONTH(N21) >= 7, YEAR(N21) + 1, YEAR(N21)),\"\")","v":""},null,{"$f":"IFERROR(IF(MONTH(P21) >= 7, YEAR(P21) + 1, YEAR(P21)),\"\")","v":""}]
[null,null,"Project ","Year 1",null,"Year 2",null,"Year 3",null,"Year 4",null,"Year 5",null,"Year 6",null,"Year 7",null,null,"Total"]
["Project Period Commitment",null,"Period",{"$f":"IF(B9<>\"\", B9,\"\")","v":""},{"$f":"IF(C9<>\"\",C9,\"\")","v":""},{"$f":"IF(E21<>\"\", E21+1,\"\")","v":""},{"$f":"IF(F21<>\"\",DATE(YEAR(F21)+1,MONTH(F21),DAY(F21)-1),\"\")","v":""},{"$f":"IF(G21<>\"\",G21+1,\"\")","v":""},{"$f":"IF(H21<>\"\", DATE(YEAR(H21)+1,MONTH(H21),DAY(H21)-1),\"\")","v":""},{"$f":"IF(I21<>\"\", I21+1,\"\")","v":""},{"$f":"IF(J21<>\"\", DATE(YEAR(J21)+1,MONTH(J21),DAY(J21)-1), \"\")","v":""},{"$f":"IF(K21<>\"\", K21+1, \"\")","v":""},{"$f":"IF(L21<>\"\", DATE(YEAR(L21)+1,MONTH(L21),DAY(L21)-1),\"\")","v":""},{"$f":"IF(M21<>\"\", M21+1, \"\")","v":""},{"$f":"IF(N21<>\"\", DATE(YEAR(N21)+1,MONTH(N21),DAY(N21)-1), \"\")","v":""},{"$f":"IF(O21<>\"\", O21+1, \"\")","v":""},{"$f":"IF(P21<>\"\", DATE(YEAR(P21)+1,MONTH(P21),DAY(P21)-1), \"\")","v":""},null,"Cost Share"]
["Budget Category","Department Source    (WBSE or Order)","Sponsored Class"]
["Professional ",{"$f":"IF(S23=0,\"\",$E$16)","v":""},78210,null,null,null,null,null,null,null,null,null,null,null,null,null,null,null,{"$f":"SUM(D23:Q23)","v":0}]
["Post Docs",{"$f":"IF(S24=0,\"\",$E$16)","v":""},78215,null,null,null,null,null,null,null,null,null,null,null,null,null,null,null,0]
["Grads","",78230,null,null,null,null,null,null,null,null,null,null,null,null,null,null,null,0]
["Clerical","",78240,null,null,null,null,null,null,null,null,null,null,null,null,null,null,null,0]
["Service & undergrads","",78250,null,null,null,null,null,null,null,null,null,null,null,null,null,null,null,0]
["Temporary Staff","",78255,null,null,null,null,null,null,null,null,null,null,null,null,null,null,null,0]
["Stipend","",78260,null,null,null,null,null,null,null,null,null,null,null,null,null,null,null,0]
["Fee Remits","",78270,null,null,null,null,null,null,null,null,null,null,null,null,null,null,null,0]
{"$rows_left_out":16}
{"sheet":"CS_Data","index":3,"n_rows":134,"n_cols":9,"rows_kept":134,"cut":false,"hidden":true,"merged":[]}
["Sponsored Program ","Fund","Cost Center/Fund Center","Order ","WBS Element ","Sponsored Class","Amount ","Fiscal Year","DK"]
[{"$f":"Form_32!J15","v":0},{"$f":"Form_32!J16","v":0},null,{"$f":"IF(AND( Form_32!B23<>\"\", MID(Form_32!B23,2,1) <> \".\"), Form_32!B23, \"\")","v":""},{"$f":"IF(AND( Form_32!B23<>\"\", MID(Form_32!B23,2,1) = \".\"), Form_32!B23, \"\")","v":""},{"$f":"Form_32!C23","v":78210},{"$f":"ROUND(Form_32!D23,2)","v":0},{"$f":"Form_32!D19","v":""},{"$f":"Form_32!D18","v":"JUL"}]
[{"$f":"Form_32!J15","v":0},{"$f":"Form_32!J16","v":0},null,{"$f":"IF(AND( Form_32!B24<>\"\", MID(Form_32!B24,2,1) <> \".\"), Form_32!B24, \"\")","v":""},{"$f":"IF(AND( Form_32!B24<>\"\", MID(Form_32!B24,2,1) = \".\"), Form_32!B24, \"\")","v":""},{"$f":"Form_32!C24","v":78215},{"$f":"ROUND(Form_32!D24,2)","v":0},{"$f":"Form_32!D19","v":""},{"$f":"Form_32!D18","v":"JUL"}]
[{"$f":"Form_32!J15","v":0},{"$f":"Form_32!J16","v":0},null,{"$f":"IF(AND( Form_32!B25<>\"\", MID(Form_32!B25,2,1) <> \".\"), Form_32!B25, \"\")","v":""},{"$f":"IF(AND( Form_32!B25<>\"\", MID(Form_32!B25,2,1) = \".\"), Form_32!B25, \"\")","v":""},{"$f":"Form_32!C25","v":78230},{"$f":"ROUND(Form_32!D25,2)","v":0},{"$f":"Form_32!D19","v":""},{"$f":"Form_32!D18","v":"JUL"}]
[{"$f":"Form_32!J15","v":0},{"$f":"Form_32!J16","v":0},null,{"$f":"IF(AND( Form_32!B26<>\"\", MID(Form_32!B26,2,1) <> \".\"), Form_32!B26, \"\")","v":""},{"$f":"IF(AND( Form_32!B26<>\"\", MID(Form_32!B26,2,1) = \".\"), Form_32!B26, \"\")","v":""},{"$f":"Form_32!C26","v":78240},{"$f":"ROUND(Form_32!D26,2)","v":0},{"$f":"Form_32!D19","v":""},{"$f":"Form_32!D18","v":"JUL"}]
[{"$f":"Form_32!J15","v":0},{"$f":"Form_32!J16","v":0},null,{"$f":"IF(AND( Form_32!B27<>\"\", MID(Form_32!B27,2,1) <> \".\"), Form_32!B27, \"\")","v":""},{"$f":"IF(AND( Form_32!B27<>\"\", MID(Form_32!B27,2,1) = \".\"), Form_32!B27, \"\")","v":""},{"$f":"Form_32!C27","v":78250},{"$f":"ROUND(Form_32!D27,2)","v":0},{"$f":"Form_32!D19","v":""},{"$f":"Form_32!D18","v":"JUL"}]
[{"$f":"Form_32!J15","v":0},{"$f":"Form_32!J16","v":0},null,{"$f":"IF(AND( Form_32!B28<>\"\", MID(Form_32!B28,2,1) <> \".\"), Form_32!B28, \"\")","v":""},{"$f":"IF(AND( Form_32!B28<>\"\", MID(Form_32!B28,2,1) = \".\"), Form_32!B28, \"\")","v":""},{"$f":"Form_32!C28","v":78255},{"$f":"ROUND(Form_32!D28,2)","v":0},{"$f":"Form_32!D19","v":""},{"$f":"Form_32!D18","v":"JUL"}]
[{"$f":"Form_32!J15","v":0},{"$f":"Form_32!J16","v":0},null,{"$f":"IF(AND( Form_32!B29<>\"\", MID(Form_32!B29,2,1) <> \".\"), Form_32!B29, \"\")","v":""},{"$f":"IF(AND( Form_32!B29<>\"\", MID(Form_32!B29,2,1) = \".\"), Form_32!B29, \"\")","v":""},{"$f":"Form_32!C29","v":78260},{"$f":"ROUND(Form_32!D29,2)","v":0},{"$f":"Form_32!D19","v":""},{"$f":"Form_32!D18","v":"JUL"}]
[{"$f":"Form_32!J15","v":0},{"$f":"Form_32!J16","v":0},null,{"$f":"IF(AND( Form_32!B30<>\"\", MID(Form_32!B30,2,1) <> \".\"), Form_32!B30, \"\")","v":""},{"$f":"IF(AND( Form_32!B30<>\"\", MID(Form_32!B30,2,1) = \".\"), Form_32!B30, \"\")","v":""},{"$f":"Form_32!C30","v":78270},{"$f":"ROUND(Form_32!D30,2)","v":0},{"$f":"Form_32!D19","v":""},{"$f":"Form_32!D18","v":"JUL"}]
[{"$f":"Form_32!J15","v":0},{"$f":"Form_32!J16","v":0},null,{"$f":"IF(AND( Form_32!B31<>\"\", MID(Form_32!B31,2,1) <> \".\"), Form_32!B31, \"\")","v":""},{"$f":"IF(AND( Form_32!B31<>\"\", MID(Form_32!B31,2,1) = \".\"), Form_32!B31, \"\")","v":""},{"$f":"Form_32!C31","v":78280},{"$f":"ROUND(Form_32!D31,2)","v":0},{"$f":"Form_32!D19","v":""},{"$f":"Form_32!D18","v":"JUL"}]
[{"$f":"Form_32!J15","v":0},{"$f":"Form_32!J16","v":0},null,{"$f":"IF(AND( Form_32!B32<>\"\", MID(Form_32!B32,2,1) <> \".\"), Form_32!B32, \"\")","v":""},{"$f":"IF(AND( Form_32!B32<>\"\", MID(Form_32!B32,2,1) = \".\"), Form_32!B32, \"\")","v":""},{"$f":"Form_32!C32","v":78410},{"$f":"ROUND(Form_32!D32,2)","v":0},{"$f":"Form_32!D19","v":""},{"$f":"Form_32!D18","v":"JUL"}]
[{"$f":"Form_32!J15","v":0},{"$f":"Form_32!J16","v":0},null,{"$f":"IF(AND( Form_32!B33<>\"\", MID(Form_32!B33,2,1) <> \".\"), Form_32!B33, \"\")","v":""},{"$f":"IF(AND( Form_32!B33<>\"\", MID(Form_32!B33,2,1) = \".\"), Form_32!B33, \"\")","v":""},{"$f":"Form_32!C33","v":78415},{"$f":"ROUND(Form_32!D33,2)","v":0},{"$f":"Form_32!D19","v":""},{"$f":"Form_32!D18","v":"JUL"}]
[{"$f":"Form_32!J15","v":0},{"$f":"Form_32!J16","v":0},null,{"$f":"IF(AND( Form_32!B34<>\"\", MID(Form_32!B34,2,1) <> \".\"), Form_32!B34, \"\")","v":""},{"$f":"IF(AND( Form_32!B34<>\"\", MID(Form_32!B34,2,1) = \".\"), Form_32!B34, \"\")","v":""},{"$f":"Form_32!C34","v":78420},{"$f":"ROUND(Form_32!D34,2)","v":0},{"$f":"Form_32!D19","v":""},{"$f":"Form_32!D18","v":"JUL"}]
[{"$f":"Form_32!J15","v":0},{"$f":"Form_32!J16","v":0},null,{"$f":"IF(AND( Form_32!B35<>\"\", MID(Form_32!B35,2,1) <> \".\"), Form_32!B35, \"\")","v":""},{"$f":"IF(AND( Form_32!B35<>\"\", MID(Form_32!B35,2,1) = \".\"), Form_32!B35, \"\")","v":""},{"$f":"Form_32!C35","v":78425},{"$f":"ROUND(Form_32!D35,2)","v":0},{"$f":"Form_32!D19","v":""},{"$f":"Form_32!D18","v":"JUL"}]
[{"$f":"Form_32!J15","v":0},{"$f":"Form_32!J16","v":0},null,{"$f":"IF(AND( Form_32!B36<>\"\", MID(Form_32!B36,2,1) <> \".\"), Form_32!B36, \"\")","v":""},{"$f":"IF(AND( Form_32!B36<>\"\", MID(Form_32!B36,2,1) = \".\"), Form_32!B36, \"\")","v":""},{"$f":"Form_32!C36","v":78430},{"$f":"ROUND(Form_32!D36,2)","v":0},{"$f":"Form_32!D19","v":""},{"$f":"Form_32!D18","v":"JUL"}]
[{"$f":"Form_32!J15","v":0},{"$f":"Form_32!J16","v":0},null,{"$f":"IF(AND( Form_32!B37<>\"\", MID(Form_32!B37,2,1) <> \".\"), Form_32!B37, \"\")","v":""},{"$f":"IF(AND( Form_32!B37<>\"\", MID(Form_32!B37,2,1) = \".\"), Form_32!B37, \"\")","v":""},{"$f":"Form_32!C37","v":78431},{"$f":"ROUND(Form_32!D37,2)","v":0},{"$f":"Form_32!D19","v":""},{"$f":"Form_32!D18","v":"JUL"}]
[{"$f":"Form_32!J15","v":0},{"$f":"Form_32!J16","v":0},null,{"$f":"IF(AND( Form_32!B38<>\"\", MID(Form_32!B38,2,1) <> \".\"), Form_32!B38, \"\")","v":""},{"$f":"IF(AND( Form_32!B38<>\"\", MID(Form_32!B38,2,1) = \".\"), Form_32!B38, \"\")","v":""},{"$f":"Form_32!C38","v":78432},{"$f":"ROUND(Form_32!D38,2)","v":0},{"$f":"Form_32!D19","v":""},{"$f":"Form_32!D18","v":"JUL"}]
[{"$f":"Form_32!J15","v":0},{"$f":"Form_32!J16","v":0},null,{"$f":"IF(AND( Form_32!B39<>\"\", MID(Form_32!B39,2,1) <> \".\"), Form_32!B39, \"\")","v":""},{"$f":"IF(AND( Form_32!B39<>\"\", MID(Form_32!B39,2,1) = \".\"), Form_32!B39, \"\")","v":""},{"$f":"Form_32!C39","v":78435},{"$f":"ROUND(Form_32!D39,2)","v":0},{"$f":"Form_32!D19","v":""},{"$f":"Form_32!D18","v":"JUL"}]
[{"$f":"Form_32!J15","v":0},{"$f":"Form_32!J16","v":0},null,{"$f":"IF(AND( Form_32!B40<>\"\", MID(Form_32!B40,2,1) <> \".\"), Form_32!B40, \"\")","v":""},{"$f":"IF(AND( Form_32!B40<>\"\", MID(Form_32!B40,2,1) = \".\"), Form_32!B40, \"\")","v":""},{"$f":"Form_32!C40","v":78499},{"$f":"ROUND(Form_32!D40,2)","v":0},{"$f":"Form_32!D19","v":""},{"$f":"Form_32!D18","v":"JUL"}]
[{"$f":"Form_32!J15","v":0},{"$f":"Form_32!J16","v":0},null,{"$f":"IF(AND( Form_32!B41<>\"\", MID(Form_32!B41,2,1) <> \".\"), Form_32!B41, \"\")","v":""},{"$f":"IF(AND( Form_32!B41<>\"\", MID(Form_32!B41,2,1) = \".\"), Form_32!B41, \"\")","v":""},{"$f":"Form_32!C41","v":78510},{"$f":"ROUND(Form_32!D41,2)","v":0},{"$f":"Form_32!D19","v":""},{"$f":"Form_32!D18","v":"JUL"}]
[{"$f":"Form_32!J15","v":0},{"$f":"Form_32!J16","v":0},null,{"$f":"IF(AND( Form_32!B23<>\"\", MID(Form_32!B23,2,1) <> \".\"), Form_32!B23, \"\")","v":""},{"$f":"IF(AND( Form_32!B23<>\"\", MID(Form_32!B23,2,1) = \".\"), Form_32!B23, \"\")","v":""},{"$f":"Form_32!C23","v":78210},{"$f":"ROUND(Form_32!F23,2)","v":0},{"$f":"Form_32!F19","v":""},{"$f":"Form_32!F18","v":"JUL"}]
[{"$f":"Form_32!J15","v":0},{"$f":"Form_32!J16","v":0},null,{"$f":"IF(AND( Form_32!B24<>\"\", MID(Form_32!B24,2,1) <> \".\"), Form_32!B24, \"\")","v":""},{"$f":"IF(AND( Form_32!B24<>\"\", MID(Form_32!B24,2,1) = \".\"), Form_32!B24, \"\")","v":""},{"$f":"Form_32!C24","v":78215},{"$f":"ROUND(Form_32!F24,2)","v":0},{"$f":"Form_32!F19","v":""},{"$f":"Form_32!F18","v":"JUL"}]
[{"$f":"Form_32!J15","v":0},{"$f":"Form_32!J16","v":0},null,{"$f":"IF(AND( Form_32!B25<>\"\", MID(Form_32!B25,2,1) <> \".\"), Form_32!B25, \"\")","v":""},{"$f":"IF(AND( Form_32!B25<>\"\", MID(Form_32!B25,2,1) = \".\"), Form_32!B25, \"\")","v":""},{"$f":"Form_32!C25","v":78230},{"$f":"ROUND(Form_32!F25,2)","v":0},{"$f":"Form_32!F19","v":""},{"$f":"Form_32!F18","v":"JUL"}]
[{"$f":"Form_32!J15","v":0},{"$f":"Form_32!J16","v":0},null,{"$f":"IF(AND( Form_32!B26<>\"\", MID(Form_32!B26,2,1) <> \".\"), Form_32!B26, \"\")","v":""},{"$f":"IF(AND( Form_32!B26<>\"\", MID(Form_32!B26,2,1) = \".\"), Form_32!B26, \"\")","v":""},{"$f":"Form_32!C26","v":78240},{"$f":"ROUND(Form_32!F26,2)","v":0},{"$f":"Form_32!F19","v":""},{"$f":"Form_32!F18","v":"JUL"}]
[{"$f":"Form_32!J15","v":0},{"$f":"Form_32!J16","v":0},null,{"$f":"IF(AND( Form_32!B27<>\"\", MID(Form_32!B27,2,1) <> \".\"), Form_32!B27, \"\")","v":""},{"$f":"IF(AND( Form_32!B27<>\"\", MID(Form_32!B27,2,1) = \".\"), Form_32!B27, \"\")","v":""},{"$f":"Form_32!C27","v":78250},{"$f":"ROUND(Form_32!F27,2)","v":0},{"$f":"Form_32!F19","v":""},{"$f":"Form_32!F18","v":"JUL"}]
[{"$f":"Form_32!J15","v":0},{"$f":"Form_32!J16","v":0},null,{"$f":"IF(AND( Form_32!B28<>\"\", MID(Form_32!B28,2,1) <> \".\"), Form_32!B28, \"\")","v":""},{"$f":"IF(AND( Form_32!B28<>\"\", MID(Form_32!B28,2,1) = \".\"), Form_32!B28, \"\")","v":""},{"$f":"Form_32!C28","v":78255},{"$f":"ROUND(Form_32!F28,2)","v":0},{"$f":"Form_32!F19","v":""},{"$f":"Form_32!F18","v":"JUL"}]
[{"$f":"Form_32!J15","v":0},{"$f":"Form_32!J16","v":0},null,{"$f":"IF(AND( Form_32!B29<>\"\", MID(Form_32!B29,2,1) <> \".\"), Form_32!B29, \"\")","v":""},{"$f":"IF(AND( Form_32!B29<>\"\", MID(Form_32!B29,2,1) = \".\"), Form_32!B29, \"\")","v":""},{"$f":"Form_32!C29","v":78260},{"$f":"ROUND(Form_32!F29,2)","v":0},{"$f":"Form_32!F19","v":""},{"$f":"Form_32!F18","v":"JUL"}]
[{"$f":"Form_32!J15","v":0},{"$f":"Form_32!J16","v":0},null,{"$f":"IF(AND( Form_32!B30<>\"\", MID(Form_32!B30,2,1) <> \".\"), Form_32!B30, \"\")","v":""},{"$f":"IF(AND( Form_32!B30<>\"\", MID(Form_32!B30,2,1) = \".\"), Form_32!B30, \"\")","v":""},{"$f":"Form_32!C30","v":78270},{"$f":"ROUND(Form_32!F30,2)","v":0},{"$f":"Form_32!F19","v":""},{"$f":"Form_32!F18","v":"JUL"}]
[{"$f":"Form_32!J15","v":0},{"$f":"Form_32!J16","v":0},null,{"$f":"IF(AND( Form_32!B31<>\"\", MID(Form_32!B31,2,1) <> \".\"), Form_32!B31, \"\")","v":""},{"$f":"IF(AND( Form_32!B31<>\"\", MID(Form_32!B31,2,1) = \".\"), Form_32!B31, \"\")","v":""},{"$f":"Form_32!C31","v":78280},{"$f":"ROUND(Form_32!F31,2)","v":0},{"$f":"Form_32!F19","v":""},{"$f":"Form_32!F18","v":"JUL"}]
[{"$f":"Form_32!J15","v":0},{"$f":"Form_32!J16","v":0},null,{"$f":"IF(AND( Form_32!B32<>\"\", MID(Form_32!B32,2,1) <> \".\"), Form_32!B32, \"\")","v":""},{"$f":"IF(AND( Form_32!B32<>\"\", MID(Form_32!B32,2,1) = \".\"), Form_32!B32, \"\")","v":""},{"$f":"Form_32!C32","v":78410},{"$f":"ROUND(Form_32!F32,2)","v":0},{"$f":"Form_32!F19","v":""},{"$f":"Form_32!F18","v":"JUL"}]
{"$rows_left_out":105}
{"sheet":"Form 32 Instructions","index":4,"n_rows":56,"n_cols":4,"rows_kept":56,"cut":false,"hidden":false,"merged":[]}
["Instructions for the Form 32",null,"UPDATED:","2025-02-05"]
[]
["The revised Form 32, Letter of Cost Sharing Commitment, is an Excel document that has been modified to automatically calculate the annual transfer amounts.   Formula calculations rely on the data being entered in the correct format."]
[]
["File can be found in SPS website http://www.purdue.edu/business/sps/xls/form32.xlsx"]
[]
["The file is saved as a read only document in the website. When accessing the file, a message box will prompt the user to open the file as “read only”.  Select “yes”.  When saving the document, Excel will prompt you to rename it."]
[]
["Enter information for the areas highlighted in pink.  The document contains many formulas, to avoid typing over a formula, enter data in pink highlighted fields only."]
[]
[]
["DEFINITION OF TERMS"]
["Cost Share Method - Select Dollar Commitment, Memo Match, Percent of Effort, or Percent of Sponsor Award.  A new cost share form should be prepared for each Cost Share Method (i.e. grad student support by PRF plus dollar commitment should have a form for both memo match and dollar commitment portion of the cost share)"]
[]
["Cost Share Type - Select one of the following options:"]
["1) Committed - Sponsor Required in RFP (Cost share is mandatory by sponsor)"]
["2) Committed - In Excess of Sponsor Required in RFP (Cost share is mandatory by sponsor but exceeds required amount)"]
["3) Committed - Not Required by Sponsor (Cost share is voluntary)"]
["4) No Cost Share (Cost share is voluntary and not allowed by the sponsor)"]
["5) Salary Cap (Effort on project exceeds NIH salary allowance so a portion of salary is cost share)"]
[]
["Dept Name - The name of the department providing the cost share support"]
[]
["Responsible Cost Center - The cost center for the department providing the cost share support"]
[]
["PI - The name of the Principal Investigator on the Proposal"]
[]
["Agency/Sponsor - The name of organization providing funding"]
[]
["Project Period - The entire period of the submitted proposal"]
{"$rows_left_out":26}